{"text_format":"1","workbook":"xlsx","n_sheets":8,"sheets":["2015 Stats","2015 entry List","Time On Off","Sign On","Sign Off","2014 Entry","Cheques","2015 entry List (2)"],"not_rendered":{"charts":4,"images":0,"macros":0,"external_links":0,"defined_names":4,"comments":5,"pivot_tables":0},"unopened":[],"bounds":{"document_bytes":16777216,"sheet_cells":100000,"rows_first":2000,"rows_last":500,"rows_between":2000,"halvings":0,"cell_chars":16384,"cell_head_chars":4096},"cells_cut":0,"cells_raw":0,"read":"whole","date_system":"1900"}

{"sheet":"2015 Stats","index":0,"n_rows":57,"n_cols":25,"rows_kept":57,"cut":false,"hidden":true,"merged":[[22,3,22,4],[4,3,4,5],[4,8,4,9],[8,19,9,21],[8,22,9,24],[4,19,4,24],[4,12,4,17],[8,12,9,14],[8,15,9,17]]}
["2015 Stats"]
[]
[]
[]
[null,null,null,"Entries",null,null,"%",null,null,null,null,null,null,null,null,null,null,null,null,"Section Stats (Both Courses)"]
["Laps",1,null,"AJ Course","Exp",15,{"$f":"F6/$F$9","v":0.68181818181818177},null,null,null,null,null,null,null,null,null,null,null,null,"0's","1's","2's","3's","5's","10's"]
["Sect",40,null,null,"Int",4,{"$f":"F7/$F$9","v":0.18181818181818182},null,null,null,null,null,null,null,null,null,null,null,null,{"$f":"SUM('2015 entry List'!BF15:BF114)","v":1416},{"$f":"SUM('2015 entry List'!BG15:BG114)","v":553},{"$f":"SUM('2015 entry List'!BH15:BH114)","v":277},{"$f":"SUM('2015 entry List'!BI15:BI114)","v":535},{"$f":"SUM('2015 entry List'!BJ15:BJ114)","v":226},{"$f":"SUM('2015 entry List'!BK15:BK114)","v":10}]
["Entry",{"$f":"F20","v":91},null,null,"Nov",4,0.18181818181818182,null,null,null,null,null,null,null,null,null,null,null,null,{"$f":"T7/$T$9","v":0.38901098901098902},0.15192307692307691,7.6098901098901092E-2,0.14697802197802198,6.2087912087912089E-2,2.7472527472527475E-3]
[null,null,null,"Total",null,{"$f":"COUNTIF('2015 entry List'!K15:K114,\"1\")","v":22},null,null,null,null,null,null,null,null,null,null,null,null,null,{"$f":"B6*B7*B8","v":3640},null,null,{"$f":"SUM(T7:Y7)","v":3017}]
[]
[]
[]
[]
[null,null,null,"50/50 Course"]
[null,null,null,null,"Exp",4,{"$f":"F15/$F$18","v":5.7971014492753624E-2}]
[null,null,null,null,"Int",12,{"$f":"F16/$F$18","v":0.17391304347826086}]
[null,null,null,null,"Nov",52,0.75362318840579712]
[null,null,null,"Total",null,{"$f":"COUNTIF('2015 entry List'!K15:K114,\"2\")","v":69}]
[]
[null,null,null,"TOTAL",null,{"$f":"SUM(F18,F9)","v":91}]
{"$rows_left_out":38}
{"sheet":"2015 entry List","index":1,"n_rows":120,"n_cols":68,"rows_kept":120,"cut":false,"hidden":true,"merged":[[12,51,12,52],[0,14,0,53],[0,54,0,55],[0,56,0,62],[12,14,12,16],[12,42,12,43],[12,17,12,20],[12,21,12,22],[12,23,12,27],[12,28,12,29],[12,30,12,31],[12,48,12,50],[12,34,12,35],[12,36,12,38],[12,39,12,41],[12,44,12,47]]}
[null,null,null,null,null,null,null,null,null,null,null,null,null,null,"Enter scores from cards/punch cards 0,1,2,3,5. If missed a section enter '10'",null,null,null,null,null,null,null,null,null,null,null,null,null,null,null,null,null,null,null,null,null,null,null,null,null,null,null,null,null,null,null,null,null,null,null,null,null,null,null,"Enter late start and/or late finish. (Max 20mins)",null,"Do not enter numbers here these totals will auto update"]
[]
[]
[]
[]
[]
[]
[null,null,"Laps",1]
[null,null,"Sections",40]
[null,null,"Entries",{"$f":"COUNTA(H15:H114)","v":92}]
[]
[]
[null,null,null,null,null,null,null,null,null,null,null,null,null,null,"Flame Thrower",null,null,"Fountains Fell",null,null,null,"Litton Track",null,"Ellershaw Farm",null,null,null,null,"Arncliffe Scree",null,null,null,"Sleets","hawkswick","Redmire",null,"Hagg Gill",null,null,"Yockenthwaite",null,null,"Raisgill",null,"Bouther Gill",null,null,null,"Wilks",null,null,"Penters A",null,"Halton Gill","late start","late finish","total","0s","1s","2s","3s","5s","10s",null,"Check 1","Check2","%  completed","% of MS"]
[100305,"RJ Sadler",30,null,32,101796,42,"Richard Sadler","Bet","E",1,"West Witton","10:21:30",{"$f":"M14+TIME(7,0,0)","v":"17:21:30"},0,0,1,0,0,0,0,0,0,2,0,0,0,0,0,0,0,0,0,0,0,0,0,0,0,0,0,0,0,0,0,0,0,0,0,0,0,0,0,0,null,null,{"$f":"SUM(O14:BD14)","v":3},{"$f":"COUNTIF(O14:BB14,0)","v":38},{"$f":"COUNTIF(O14:BB14,1)","v":1},{"$f":"COUNTIF(O14:BB14,2)","v":1},{"$f":"COUNTIF(O14:BB14,3)","v":0},{"$f":"COUNTIF(O14:BB14,5)","v":0},{"$f":"COUNTIF(O14:BB14,10)","v":0}]
[322,"Ian Austermuhle",30,null,13,5401,56,"Ian Austermuhle","Bet","E",1,"Malton","10:28:30",{"$f":"M15+TIME(7,0,0)","v":"17:28:30"},0,0,0,0,1,1,0,0,0,0,0,0,1,1,0,0,0,0,2,0,3,0,0,0,0,0,0,0,0,0,0,0,0,0,0,0,0,0,2,0,null,null,{"$f":"SUM(O15:BD15)","v":11},{"$f":"COUNTIF(O15:BB15,0)","v":33},{"$f":"COUNTIF(O15:BB15,1)","v":4},{"$f":"COUNTIF(O15:BB15,2)","v":2},{"$f":"COUNTIF(O15:BB15,3)","v":1},{"$f":"COUNTIF(O15:BB15,5)","v":0},{"$f":"COUNTIF(O15:BB15,10)","v":0},null,{"$f":"$D$9*$D$8","v":40},{"$f":"SUM(BF15:BK15)","v":40},{"$f":"BN15/BM15","v":1},{"$f":"BK15/BN15","v":0}]
[260,"P waite",30,null,2,109873,57,"Rob Waite","bet","E",1,"Darlington","10:29:00",{"$f":"M16+TIME(7,0,0)","v":"17:29:00"},0,0,0,0,2,1,0,2,0,2,1,0,2,1,0,0,0,0,2,1,1,0,0,0,0,0,0,0,0,0,0,3,0,0,0,0,0,0,1,0,null,null,{"$f":"SUM(O16:BD16)","v":19},{"$f":"COUNTIF(O16:BB16,0)","v":28},{"$f":"COUNTIF(O16:BB16,1)","v":6},{"$f":"COUNTIF(O16:BB16,2)","v":5},{"$f":"COUNTIF(O16:BB16,3)","v":1},{"$f":"COUNTIF(O16:BB16,5)","v":0},{"$f":"COUNTIF(O16:BB16,10)","v":0},null,{"$f":"$D$9*$D$8","v":40},{"$f":"SUM(BF16:BK16)","v":40},{"$f":"BN16/BM16","v":1},{"$f":"BK16/BN16","v":0}]
[100412,"D Thorpe",60,null,33,10678,45,"Dan Thorpe","Gas","E",1,"Sheffield","10:23:00",{"$f":"M17+TIME(7,0,0)","v":"17:23:00"},0,0,1,0,5,0,1,5,0,1,0,0,0,1,0,0,0,5,0,1,0,0,0,0,0,0,0,0,0,0,0,1,0,0,0,1,1,0,0,0,null,null,{"$f":"SUM(O17:BD17)","v":23},{"$f":"COUNTIF(O17:BB17,0)","v":29},{"$f":"COUNTIF(O17:BB17,1)","v":8},{"$f":"COUNTIF(O17:BB17,2)","v":0},{"$f":"COUNTIF(O17:BB17,3)","v":0},{"$f":"COUNTIF(O17:BB17,5)","v":3},{"$f":"COUNTIF(O17:BB17,10)","v":0},null,{"$f":"$D$9*$D$8","v":40},{"$f":"SUM(BF17:BK17)","v":40},{"$f":"BN17/BM17","v":1},{"$f":"BK17/BN17","v":0}]
[22106,"G Kendreew",30,null,31,65411,54,"Guy Kendrew","Bet","E",1,"Faceby","10:27:30",{"$f":"M18+TIME(7,0,0)","v":"17:27:30"},0,0,1,0,0,1,2,0,0,2,0,0,0,2,0,0,0,0,0,1,1,5,0,0,0,0,0,0,1,0,0,0,0,0,0,0,2,3,0,0,3,null,{"$f":"SUM(O18:BD18)","v":24},{"$f":"COUNTIF(O18:BB18,0)","v":29},{"$f":"COUNTIF(O18:BB18,1)","v":5},{"$f":"COUNTIF(O18:BB18,2)","v":4},{"$f":"COUNTIF(O18:BB18,3)","v":1},{"$f":"COUNTIF(O18:BB18,5)","v":1},{"$f":"COUNTIF(O18:BB18,10)","v":0},null,{"$f":"$D$9*$D$8","v":40},{"$f":"SUM(BF18:BK18)","v":40},{"$f":"BN18/BM18","v":1},{"$f":"BK18/BN18","v":0}]
[100060,"DJ Gamble",30,null,55,63776,62,"Danny Gamble","She","E",1,"Harrogate","10:31:30",{"$f":"M19+TIME(7,0,0)","v":"17:31:30"},0,0,0,0,0,1,3,3,1,1,1,0,0,1,0,0,5,2,2,1,0,0,0,0,0,0,0,0,0,0,0,0,0,0,0,0,1,3,0,0,null,null,{"$f":"SUM(O19:BD19)","v":25},{"$f":"COUNTIF(O19:BB19,0)","v":27},{"$f":"COUNTIF(O19:BB19,1)","v":7},{"$f":"COUNTIF(O19:BB19,2)","v":2},{"$f":"COUNTIF(O19:BB19,3)","v":3},{"$f":"COUNTIF(O19:BB19,5)","v":1},{"$f":"COUNTIF(O19:BB19,10)","v":0},null,{"$f":"$D$9*$D$8","v":40},{"$f":"SUM(BF19:BK19)","v":40},{"$f":"BN19/BM19","v":1},{"$f":"BK19/BN19","v":0}]
[49,"Area ISI Ltd",30,null,61,99931,58,"Sam Beecroft-Penny","She","E",1,"Yeadon","10:29:30",{"$f":"M20+TIME(7,0,0)","v":"17:29:30"},0,0,0,0,3,5,0,1,1,0,0,0,0,3,0,0,0,0,2,3,0,1,0,0,0,0,0,0,3,0,0,1,0,0,0,5,1,1,1,1,null,null,{"$f":"SUM(O20:BD20)","v":32},{"$f":"COUNTIF(O20:BB20,0)","v":25},{"$f":"COUNTIF(O20:BB20,1)","v":8},{"$f":"COUNTIF(O20:BB20,2)","v":1},{"$f":"COUNTIF(O20:BB20,3)","v":4},{"$f":"COUNTIF(O20:BB20,5)","v":2},{"$f":"COUNTIF(O20:BB20,10)","v":0},null,{"$f":"$D$9*$D$8","v":40},{"$f":"SUM(BF20:BK20)","v":40},{"$f":"BN20/BM20","v":1},{"$f":"BK20/BN20","v":0}]
{"$rows_left_out":101}
{"sheet":"Time On Off","index":2,"n_rows":0,"n_cols":0,"rows_kept":0,"cut":false,"hidden":true,"merged":[[0,3,0,5],[1,3,1,5],[2,3,2,5],[3,3,3,5]]}

{"sheet":"Sign On","index":3,"n_rows":0,"n_cols":0,"rows_kept":0,"cut":false,"hidden":true,"merged":[]}

{"sheet":"Sign Off","index":4,"n_rows":0,"n_cols":0,"rows_kept":0,"cut":false,"hidden":true,"merged":[[0,1,0,2],[1,1,1,2],[2,1,2,2],[3,1,3,2]]}

{"sheet":"2014 Entry","index":5,"n_rows":121,"n_cols":64,"rows_kept":121,"cut":false,"hidden":true,"merged":[[0,30,0,31],[0,12,0,14],[0,15,0,17],[0,18,0,20],[0,21,0,24],[0,25,0,28],[0,49,0,50],[0,32,0,35],[0,36,0,39],[0,40,0,41],[0,42,0,43],[0,44,0,46],[0,47,0,48]]}
[null,null,null,null,null,null,null,null,null,null,null,null,"Flame Thrower",null,null,"Fountains Fell",null,null,"Litton Track",null,null,"Ellershaw Farm",null,null,null,"Arncliffe Scree",null,null,null,"Hawkswick","Sleets",null,"Hagg Gill",null,null,null,"Yockenthwaite",null,null,null,"Raisgill",null,"Bouther Gill",null,"Wilks Field",null,null,"Robbo's A",null,"Newshot Gill",null,"Halton Gill"]
["Chq No","Name","Amount","Start","Finish","ACU","No.","Name","Bike","CL","CO","Town",1,2,3,4,5,6,7,8,9,10,11,12,13,14,15,16,17,18,19,20,21,22,23,24,25,26,27,28,29,30,31,32,33,34,35,36,37,38,39,40,"late start","late finish","total","0s","1s","2s","3s","5s","10s",null,"Check 1","Check2"]
[null,null,null,"10:01:00",{"$f":"D3+TIME(7,0,0)","v":"17:01:00"},null,1,null,null,null,null,null,null,null,null,null,null,null,null,null,null,null,null,null,null,null,null,null,null,null,null,null,null,null,null,null,null,null,null,null,null,null,null,null,null,null,null,null,null,null,null,null,null,null,{"$f":"SUM(M3:BB3)","v":0},{"$f":"COUNTIF(M3:AZ3,0)","v":0},{"$f":"COUNTIF(M3:AZ3,1)","v":0},{"$f":"COUNTIF(M3:AZ3,2)","v":0},{"$f":"COUNTIF(M3:AZ3,3)","v":0},{"$f":"COUNTIF(M3:AZ3,5)","v":0},{"$f":"COUNTIF(M3:AZ3,10)","v":0},null,{"$f":"COUNTA(M3:AZ3)","v":0},{"$f":"SUM(BD3:BI3)","v":0}]
[null,null,null,"10:01:30",{"$f":"D4+TIME(7,0,0)","v":"17:01:30"},null,2,null,null,null,null,null,null,null,null,null,null,null,null,null,null,null,null,null,null,null,null,null,null,null,null,null,null,null,null,null,null,null,null,null,null,null,null,null,null,null,null,null,null,null,null,null,null,null,0,0,0,0,0,0,0,null,0,0]
[null,null,null,"10:02:00","17:02:00",null,3,null,null,null,null,null,null,null,null,null,null,null,null,null,null,null,null,null,null,null,null,null,null,null,null,null,null,null,null,null,null,null,null,null,null,null,null,null,null,null,null,null,null,null,null,null,null,null,0,0,0,0,0,0,0,null,0,0]
[null,null,null,"10:02:30","17:02:30",null,4,null,null,null,null,null,null,null,null,null,null,null,null,null,null,null,null,null,null,null,null,null,null,null,null,null,null,null,null,null,null,null,null,null,null,null,null,null,null,null,null,null,null,null,null,null,null,null,0,0,0,0,0,0,0,null,0,0]
[100605,"JP Banks",84,"10:03:00","17:03:00",148919,5,"John Banks","Mon","N","B","Thirsk",null,null,null,null,null,null,null,null,null,null,null,null,null,null,null,null,null,null,null,null,null,null,null,null,null,null,null,null,null,null,null,null,null,null,null,null,null,null,null,null,null,null,0,0,0,0,0,0,0,null,0,0]
[null,null,null,"10:03:30","17:03:30",10991,6,"David Hardy","Mon","N","B","Sutton on Forest",null,null,null,null,null,null,null,null,null,null,null,null,null,null,null,null,null,null,null,null,null,null,null,null,null,null,null,null,null,null,null,null,null,null,null,null,null,null,null,null,null,null,0,0,0,0,0,0,0,null,0,0]
[null,null,null,"10:04:00","17:04:00",64977,7,"Richard Sanderson","Gas","N","B","Eastwold",null,null,null,null,null,null,null,null,null,null,null,null,null,null,null,null,null,null,null,null,null,null,null,null,null,null,null,null,null,null,null,null,null,null,null,null,null,null,null,null,null,null,0,0,0,0,0,0,0,null,0,0]
[299803,"Yorkshire BS",28,"10:04:30","17:04:30",5957,8,"Andrew Jackson","Gas","N","B","Thornhill",null,null,null,null,null,null,null,null,null,null,null,null,null,null,null,null,null,null,null,null,null,null,null,null,null,null,null,null,null,null,null,null,null,null,null,null,null,null,null,null,null,null,0,0,0,0,0,0,0,null,0,0]
[100320,"JH Lee",56,"10:05:00","17:05:00",6173,9,"Jonathan Lee","She","E","B","Higham Ferrers",null,null,null,null,null,null,null,null,null,null,null,null,null,null,null,null,null,null,null,null,null,null,null,null,null,null,null,null,null,null,null,null,null,null,null,null,null,null,null,null,null,null,0,0,0,0,0,0,0,null,0,0]
[null,null,null,"10:05:30","17:05:30",72694,10,"Steve Swanson","Bet","E","B","Finedon",null,null,null,null,null,null,null,null,null,null,null,null,null,null,null,null,null,null,null,null,null,null,null,null,null,null,null,null,null,null,null,null,null,null,null,null,null,null,null,null,null,null,0,0,0,0,0,0,0,null,0,0]
[100051,"I Rutter",56,"10:06:00","17:06:00",15597,11,"Ian Rutter","Gas","N","B","Hunwick",null,null,null,null,null,null,null,null,null,null,null,null,null,null,null,null,null,null,null,null,null,null,null,null,null,null,null,null,null,null,null,null,null,null,null,null,null,null,null,null,null,null,0,0,0,0,0,0,0,null,0,0]
[null,null,null,"10:06:30","17:06:30",8866,12,"Geoff Fielding","Gas","N","B","Hunwick",null,null,null,null,null,null,null,null,null,null,null,null,null,null,null,null,null,null,null,null,null,null,null,null,null,null,null,null,null,null,null,null,null,null,null,null,null,null,null,null,null,null,0,0,0,0,0,0,0,null,0,0]
[100147,"Mr DM Coulson",28,"10:07:00","17:07:00",108669,13,"David Coulson","Gas","N","B","York",null,null,null,null,null,null,null,null,null,null,null,null,null,null,null,null,null,null,null,null,null,null,null,null,null,null,null,null,null,null,null,null,null,null,null,null,null,null,null,null,null,null,0,0,0,0,0,0,0,null,0,0]
[100145,"Mr DM Coulson",28,"10:07:30","17:07:30",44656,14,"Alan Carr","Gas","E","B","Scarborough",null,null,null,null,null,null,null,null,null,null,null,null,null,null,null,null,null,null,null,null,null,null,null,null,null,null,null,null,null,null,null,null,null,null,null,null,null,null,null,null,null,null,0,0,0,0,0,0,0,null,0,0]
[100146,"Mr DM Coulson",28,"10:08:00","17:08:00",77921,15,"Mark Coulson","Gas","E","B","York",null,null,null,null,null,null,null,null,null,null,null,null,null,null,null,null,null,null,null,null,null,null,null,null,null,null,null,null,null,null,null,null,null,null,null,null,null,null,null,null,null,null,0,0,0,0,0,0,0,null,0,0]
[22003,"P Kershaw",28,"10:08:30","17:08:30",108787,16,"Mark Taylor","Bet","I","B","Scarborough",null,null,null,null,null,null,null,null,null,null,null,null,null,null,null,null,null,null,null,null,null,null,null,null,null,null,null,null,null,null,null,null,null,null,null,null,null,null,null,null,null,null,0,0,0,0,0,0,0,null,0,0]
[22004,"P Kershaw",28,"10:09:00","17:09:00",25414,17,"Simon Kershaw","Bet","E","A","Scarborough",null,null,null,null,null,null,null,null,null,null,null,null,null,null,null,null,null,null,null,null,null,null,null,null,null,null,null,null,null,null,null,null,null,null,null,null,null,null,null,null,null,null,0,0,0,0,0,0,0,null,0,0]
[264,"P Scott",28,"10:09:30","17:09:30",108543,18,"Phil Scott","Gas","N","B","Barrowford",null,null,null,null,null,null,null,null,null,null,null,null,null,null,null,null,null,null,null,null,null,null,null,null,null,null,null,null,null,null,null,null,null,null,null,null,null,null,null,null,null,null,0,0,0,0,0,0,0,null,0,0]
{"$rows_left_out":102}
{"sheet":"Cheques","index":6,"n_rows":96,"n_cols":4,"rows_kept":96,"cut":false,"hidden":true,"merged":[]}
[]
[]
[]
[null,"Chq No","Name","Amount"]
[null,10,"Sam Yeadon",30]
[null,260,"P waite",30]
[null,100136,"Mr N cockerham",30]
[null,null,"PAY PAL",30]
[null,null,"PAY PAL",30]
[null,100330,"JH Lee",60]
[null,111]
[null,100175,"DM Coulson",30]
[null,100173,"DM Coulson",30]
[null,100036,"AJ West",30]
[null,422456,"Mayne |Gas heatin",30]
[null,null,"NOT PAID"]
[null,322,"Ian Austermuhle",30]
[null,2,"S McElnea",30]
[null,161,"PS Marwood",30]
[null,100047,"AG Frith",30]
{"$rows_left_out":77}
{"sheet":"2015 entry List (2)","index":7,"n_rows":120,"n_cols":68,"rows_kept":120,"cut":false,"hidden":false,"merged":[[12,36,12,38],[12,39,12,41],[12,42,12,43],[12,44,12,47],[12,48,12,50],[12,51,12,52],[0,14,0,53],[0,54,0,55],[0,56,0,62],[12,14,12,16],[12,17,12,20],[12,21,12,22],[12,23,12,27],[12,28,12,29],[12,30,12,31],[12,34,12,35]]}
[null,null,null,null,null,null,null,null,null,null,null,null,null,null,"Enter scores from cards/punch cards 0,1,2,3,5. If missed a section enter '10'",null,null,null,null,null,null,null,null,null,null,null,null,null,null,null,null,null,null,null,null,null,null,null,null,null,null,null,null,null,null,null,null,null,null,null,null,null,null,null,"Enter late start and/or late finish. (Max 20mins)",null,"Do not enter numbers here these totals will auto update"]
[]
[]
[]
[]
[]
[]
[null,null,"Laps",1]
[null,null,"Sections",40]
[null,null,"Entries",{"$f":"COUNTA(H15:H114)","v":92}]
[]
[]
[null,null,null,null,null,null,null,null,null,null,null,null,null,null,"Flame Thrower",null,null,"Fountains Fell",null,null,null,"Litton Track",null,"Ellershaw Farm",null,null,null,null,"Arncliffe Scree",null,null,null,"Sleets","hawkswick","Redmire",null,"Hagg Gill",null,null,"Yockenthwaite",null,null,"Raisgill",null,"Bouther Gill",null,null,null,"Wilks",null,null,"Penters A",null,"Halton Gill","late start","late finish","total","0s","1s","2s","3s","5s","10s",null,"Check 1","Check2","%  completed","% of MS"]
[100305,"RJ Sadler",30,null,32,101796,42,"Richard Sadler","Bet","E",1,"West Witton","10:21:30",{"$f":"M14+TIME(7,0,0)","v":"17:21:30"},0,0,1,0,0,0,0,0,0,2,0,0,0,0,0,0,0,0,0,0,0,0,0,0,0,0,0,0,0,0,0,0,0,0,0,0,0,0,0,0,null,null,{"$f":"SUM(O14:BD14)","v":3},{"$f":"COUNTIF(O14:BB14,0)","v":38},{"$f":"COUNTIF(O14:BB14,1)","v":1},{"$f":"COUNTIF(O14:BB14,2)","v":1},{"$f":"COUNTIF(O14:BB14,3)","v":0},{"$f":"COUNTIF(O14:BB14,5)","v":0},{"$f":"COUNTIF(O14:BB14,10)","v":0}]
[322,"Ian Austermuhle",30,null,13,5401,56,"Ian Austermuhle","Bet","E",1,"Malton","10:28:30",{"$f":"M15+TIME(7,0,0)","v":"17:28:30"},0,0,0,0,1,1,0,0,0,0,0,0,1,1,0,0,0,0,2,0,3,0,0,0,0,0,0,0,0,0,0,0,0,0,0,0,0,0,2,0,null,null,{"$f":"SUM(O15:BD15)","v":11},{"$f":"COUNTIF(O15:BB15,0)","v":33},{"$f":"COUNTIF(O15:BB15,1)","v":4},{"$f":"COUNTIF(O15:BB15,2)","v":2},{"$f":"COUNTIF(O15:BB15,3)","v":1},{"$f":"COUNTIF(O15:BB15,5)","v":0},{"$f":"COUNTIF(O15:BB15,10)","v":0},null,{"$f":"$D$9*$D$8","v":40},{"$f":"SUM(BF15:BK15)","v":40},{"$f":"BN15/BM15","v":1},{"$f":"BK15/BN15","v":0}]
[260,"P waite",30,null,2,109873,57,"Rob Waite","bet","E",1,"Darlington","10:29:00",{"$f":"M16+TIME(7,0,0)","v":"17:29:00"},0,0,0,0,2,1,0,2,0,2,1,0,2,1,0,0,0,0,2,1,1,0,0,0,0,0,0,0,0,0,0,3,0,0,0,0,0,0,1,0,null,null,{"$f":"SUM(O16:BD16)","v":19},{"$f":"COUNTIF(O16:BB16,0)","v":28},{"$f":"COUNTIF(O16:BB16,1)","v":6},{"$f":"COUNTIF(O16:BB16,2)","v":5},{"$f":"COUNTIF(O16:BB16,3)","v":1},{"$f":"COUNTIF(O16:BB16,5)","v":0},{"$f":"COUNTIF(O16:BB16,10)","v":0},null,{"$f":"$D$9*$D$8","v":40},{"$f":"SUM(BF16:BK16)","v":40},{"$f":"BN16/BM16","v":1},{"$f":"BK16/BN16","v":0}]
[100412,"D Thorpe",60,null,33,10678,45,"Dan Thorpe","Gas","E",1,"Sheffield","10:23:00",{"$f":"M17+TIME(7,0,0)","v":"17:23:00"},0,0,1,0,5,0,1,5,0,1,0,0,0,1,0,0,0,5,0,1,0,0,0,0,0,0,0,0,0,0,0,1,0,0,0,1,1,0,0,0,null,null,{"$f":"SUM(O17:BD17)","v":23},{"$f":"COUNTIF(O17:BB17,0)","v":29},{"$f":"COUNTIF(O17:BB17,1)","v":8},{"$f":"COUNTIF(O17:BB17,2)","v":0},{"$f":"COUNTIF(O17:BB17,3)","v":0},{"$f":"COUNTIF(O17:BB17,5)","v":3},{"$f":"COUNTIF(O17:BB17,10)","v":0},null,{"$f":"$D$9*$D$8","v":40},{"$f":"SUM(BF17:BK17)","v":40},{"$f":"BN17/BM17","v":1},{"$f":"BK17/BN17","v":0}]
[22106,"G Kendreew",30,null,31,65411,54,"Guy Kendrew","Bet","E",1,"Faceby","10:27:30",{"$f":"M18+TIME(7,0,0)","v":"17:27:30"},0,0,1,0,0,1,2,0,0,2,0,0,0,2,0,0,0,0,0,1,1,5,0,0,0,0,0,0,1,0,0,0,0,0,0,0,2,3,0,0,3,null,{"$f":"SUM(O18:BD18)","v":24},{"$f":"COUNTIF(O18:BB18,0)","v":29},{"$f":"COUNTIF(O18:BB18,1)","v":5},{"$f":"COUNTIF(O18:BB18,2)","v":4},{"$f":"COUNTIF(O18:BB18,3)","v":1},{"$f":"COUNTIF(O18:BB18,5)","v":1},{"$f":"COUNTIF(O18:BB18,10)","v":0},null,{"$f":"$D$9*$D$8","v":40},{"$f":"SUM(BF18:BK18)","v":40},{"$f":"BN18/BM18","v":1},{"$f":"BK18/BN18","v":0}]
[100060,"DJ Gamble",30,null,55,63776,62,"Danny Gamble","She","E",1,"Harrogate","10:31:30",{"$f":"M19+TIME(7,0,0)","v":"17:31:30"},0,0,0,0,0,1,3,3,1,1,1,0,0,1,0,0,5,2,2,1,0,0,0,0,0,0,0,0,0,0,0,0,0,0,0,0,1,3,0,0,null,null,{"$f":"SUM(O19:BD19)","v":25},{"$f":"COUNTIF(O19:BB19,0)","v":27},{"$f":"COUNTIF(O19:BB19,1)","v":7},{"$f":"COUNTIF(O19:BB19,2)","v":2},{"$f":"COUNTIF(O19:BB19,3)","v":3},{"$f":"COUNTIF(O19:BB19,5)","v":1},{"$f":"COUNTIF(O19:BB19,10)","v":0},null,{"$f":"$D$9*$D$8","v":40},{"$f":"SUM(BF19:BK19)","v":40},{"$f":"BN19/BM19","v":1},{"$f":"BK19/BN19","v":0}]
[49,"Area ISI Ltd",30,null,61,99931,58,"Sam Beecroft-Penny","She","E",1,"Yeadon","10:29:30",{"$f":"M20+TIME(7,0,0)","v":"17:29:30"},0,0,0,0,3,5,0,1,1,0,0,0,0,3,0,0,0,0,2,3,0,1,0,0,0,0,0,0,3,0,0,1,0,0,0,5,1,1,1,1,null,null,{"$f":"SUM(O20:BD20)","v":32},{"$f":"COUNTIF(O20:BB20,0)","v":25},{"$f":"COUNTIF(O20:BB20,1)","v":8},{"$f":"COUNTIF(O20:BB20,2)","v":1},{"$f":"COUNTIF(O20:BB20,3)","v":4},{"$f":"COUNTIF(O20:BB20,5)","v":2},{"$f":"COUNTIF(O20:BB20,10)","v":0},null,{"$f":"$D$9*$D$8","v":40},{"$f":"SUM(BF20:BK20)","v":40},{"$f":"BN20/BM20","v":1},{"$f":"BK20/BN20","v":0}]
{"$rows_left_out":100}